Trunk build broken (test case involving document-rotation)

classic Classic list List threaded Threaded
3 messages Options
Reply | Threaded
Open this post in threaded view
|  
Report Content as Inappropriate

Trunk build broken (test case involving document-rotation)

Bryce Harrington-3
[==========] Running 4 tests from 1 test case.
[----------] Global test environment set-up.
[----------] 4 tests from AttributesTest
[ RUN      ] AttributesTest.SupportedKnown
[       OK ] AttributesTest.SupportedKnown (2 ms)
[ RUN      ] AttributesTest.NameRoundTrip
[       OK ] AttributesTest.NameRoundTrip (1 ms)
[ RUN      ] AttributesTest.ValuesAreKnown
/<<BUILDDIR>>/inkscape-trunk-0.92.0+devel+15444+85~ubuntu16.10.1/testfiles/src/attributes-test.cpp:613:
Failure
Value of: ids[i] > 0
  Actual: false
Expected: true
Attribute string with enum 59 {inkscape:document-rotation} not handled
[  FAILED  ] AttributesTest.ValuesAreKnown (4 ms)
[ RUN      ] AttributesTest.ValuesUnique
[       OK ] AttributesTest.ValuesUnique (2 ms)
[----------] 4 tests from AttributesTest (9 ms total)

[----------] Global test environment tear-down
[==========] 4 tests from 1 test case ran. (9 ms total)
[  PASSED  ] 3 tests.
[  FAILED  ] 1 test, listed below:
[  FAILED  ] AttributesTest.ValuesAreKnown

 1 FAILED TEST

3/5 Test #2: color-profile-test ...............   Passed    5.74 sec
4/5 Test #3: dir-util-test ....................   Passed    5.73 sec
    Start 5: object-set-test
5/5 Test #5: object-set-test ..................   Passed    0.31 sec

80% tests passed, 1 tests failed out of 5

Total Test time (real) =   6.06 sec

The following tests FAILED:
      1 - attributes-test (Failed)
Errors while running CTest
Makefile:130: recipe for target 'test' failed


----- Forwarded message from Launchpad Buildd System <[hidden email]> -----

Date: Wed, 25 Jan 2017 05:27:43 -0000
From: Launchpad Buildd System <[hidden email]>
To: Bryce Harrington <[hidden email]>
Subject: [Build #11913969] amd64 build of inkscape-trunk 1:0.92.0+devel+15444+85~ubuntu16.10.1 in ubuntu yakkety RELEASE
        [~inkscape.dev/ubuntu/trunk]
Reply-To: Launchpad Buildd System <[hidden email]>


 * Source Package: inkscape-trunk
 * Version: 1:0.92.0+devel+15444+85~ubuntu16.10.1
 * Architecture: amd64
 * Archive: ~inkscape.dev/ubuntu/trunk
 * Component: main
 * State: Failed to build
 * Duration: 45 minutes
 * Build Log: https://launchpad.net/~inkscape.dev/+archive/ubuntu/trunk/+build/11913969/+files/buildlog_ubuntu-yakkety-amd64.inkscape-trunk_1%3A0.92.0+devel+15444+85~ubuntu16.10.1_BUILDING.txt.gz
 * Builder: https://launchpad.net/builders/lgw01-42
 * Source: not available



If you want further information about this situation, feel free to
contact a member of the Launchpad Buildd Administrators team.

--
amd64 build of inkscape-trunk 1:0.92.0+devel+15444+85~ubuntu16.10.1 in ubuntu yakkety RELEASE
https://launchpad.net/~inkscape.dev/+archive/ubuntu/trunk/+build/11913969

You are receiving this email because your team Inkscape Developers is
the owner of this archive.

----- End forwarded message -----

------------------------------------------------------------------------------
Check out the vibrant tech community on one of the world's most
engaging tech sites, SlashDot.org! http://sdm.link/slashdot
_______________________________________________
Inkscape-devel mailing list
[hidden email]
https://lists.sourceforge.net/lists/listinfo/inkscape-devel
Reply | Threaded
Open this post in threaded view
|  
Report Content as Inappropriate

Re: Trunk build broken (test case involving document-rotation)

Jabier Arraiza
Fixed. Sorry for the delay and thanks Mc for help me to run check OK.

Cheers, Jabier.

On Wed, 2017-01-25 at 01:01 -0800, Bryce Harrington wrote:

> [==========] Running 4 tests from 1 test case.
> [----------] Global test environment set-up.
> [----------] 4 tests from AttributesTest
> [ RUN      ] AttributesTest.SupportedKnown
> [       OK ] AttributesTest.SupportedKnown (2 ms)
> [ RUN      ] AttributesTest.NameRoundTrip
> [       OK ] AttributesTest.NameRoundTrip (1 ms)
> [ RUN      ] AttributesTest.ValuesAreKnown
> /<<BUILDDIR>>/inkscape-trunk-
> 0.92.0+devel+15444+85~ubuntu16.10.1/testfiles/src/attributes-
> test.cpp:613:
> Failure
> Value of: ids[i] > 0
>   Actual: false
> Expected: true
> Attribute string with enum 59 {inkscape:document-rotation} not
> handled
> [  FAILED  ] AttributesTest.ValuesAreKnown (4 ms)
> [ RUN      ] AttributesTest.ValuesUnique
> [       OK ] AttributesTest.ValuesUnique (2 ms)
> [----------] 4 tests from AttributesTest (9 ms total)
>
> [----------] Global test environment tear-down
> [==========] 4 tests from 1 test case ran. (9 ms total)
> [  PASSED  ] 3 tests.
> [  FAILED  ] 1 test, listed below:
> [  FAILED  ] AttributesTest.ValuesAreKnown
>
>  1 FAILED TEST
>
> 3/5 Test #2: color-profile-test ...............   Passed    5.74 sec
> 4/5 Test #3: dir-util-test ....................   Passed    5.73 sec
>     Start 5: object-set-test
> 5/5 Test #5: object-set-test ..................   Passed    0.31 sec
>
> 80% tests passed, 1 tests failed out of 5
>
> Total Test time (real) =   6.06 sec
>
> The following tests FAILED:
>       1 - attributes-test (Failed)
> Errors while running CTest
> Makefile:130: recipe for target 'test' failed
>
>
> ----- Forwarded message from Launchpad Buildd System <noreply@launchp
> ad.net> -----
>
> Date: Wed, 25 Jan 2017 05:27:43 -0000
> From: Launchpad Buildd System <[hidden email]>
> To: Bryce Harrington <[hidden email]>
> Subject: [Build #11913969] amd64 build of inkscape-trunk
> 1:0.92.0+devel+15444+85~ubuntu16.10.1 in ubuntu yakkety RELEASE
> [~inkscape.dev/ubuntu/trunk]
> Reply-To: Launchpad Buildd System <[hidden email]>
>
>
>  * Source Package: inkscape-trunk
>  * Version: 1:0.92.0+devel+15444+85~ubuntu16.10.1
>  * Architecture: amd64
>  * Archive: ~inkscape.dev/ubuntu/trunk
>  * Component: main
>  * State: Failed to build
>  * Duration: 45 minutes
>  * Build Log: https://launchpad.net/~inkscape.dev/+archive/ubuntu/tru
> nk/+build/11913969/+files/buildlog_ubuntu-yakkety-amd64.inkscape-
> trunk_1%3A0.92.0+devel+15444+85~ubuntu16.10.1_BUILDING.txt.gz
>  * Builder: https://launchpad.net/builders/lgw01-42
>  * Source: not available
>
>
>
> If you want further information about this situation, feel free to
> contact a member of the Launchpad Buildd Administrators team.
>

------------------------------------------------------------------------------
Check out the vibrant tech community on one of the world's most
engaging tech sites, SlashDot.org! http://sdm.link/slashdot
_______________________________________________
Inkscape-devel mailing list
[hidden email]
https://lists.sourceforge.net/lists/listinfo/inkscape-devel
Reply | Threaded
Open this post in threaded view
|  
Report Content as Inappropriate

Re: Trunk build broken (test case involving document-rotation)

Bryce Harrington-3
Thanks Jabier

On Wed, Jan 25, 2017 at 07:49:30PM +0100, Jabier Arraiza wrote:

> Fixed. Sorry for the delay and thanks Mc for help me to run check OK.
>
> Cheers, Jabier.
>
> On Wed, 2017-01-25 at 01:01 -0800, Bryce Harrington wrote:
> > [==========] Running 4 tests from 1 test case.
> > [----------] Global test environment set-up.
> > [----------] 4 tests from AttributesTest
> > [ RUN      ] AttributesTest.SupportedKnown
> > [       OK ] AttributesTest.SupportedKnown (2 ms)
> > [ RUN      ] AttributesTest.NameRoundTrip
> > [       OK ] AttributesTest.NameRoundTrip (1 ms)
> > [ RUN      ] AttributesTest.ValuesAreKnown
> > /<<BUILDDIR>>/inkscape-trunk-
> > 0.92.0+devel+15444+85~ubuntu16.10.1/testfiles/src/attributes-
> > test.cpp:613:
> > Failure
> > Value of: ids[i] > 0
> >   Actual: false
> > Expected: true
> > Attribute string with enum 59 {inkscape:document-rotation} not
> > handled
> > [  FAILED  ] AttributesTest.ValuesAreKnown (4 ms)
> > [ RUN      ] AttributesTest.ValuesUnique
> > [       OK ] AttributesTest.ValuesUnique (2 ms)
> > [----------] 4 tests from AttributesTest (9 ms total)
> >
> > [----------] Global test environment tear-down
> > [==========] 4 tests from 1 test case ran. (9 ms total)
> > [  PASSED  ] 3 tests.
> > [  FAILED  ] 1 test, listed below:
> > [  FAILED  ] AttributesTest.ValuesAreKnown
> >
> >  1 FAILED TEST
> >
> > 3/5 Test #2: color-profile-test ...............   Passed    5.74 sec
> > 4/5 Test #3: dir-util-test ....................   Passed    5.73 sec
> >     Start 5: object-set-test
> > 5/5 Test #5: object-set-test ..................   Passed    0.31 sec
> >
> > 80% tests passed, 1 tests failed out of 5
> >
> > Total Test time (real) =   6.06 sec
> >
> > The following tests FAILED:
> >       1 - attributes-test (Failed)
> > Errors while running CTest
> > Makefile:130: recipe for target 'test' failed
> >
> >
> > ----- Forwarded message from Launchpad Buildd System <noreply@launchp
> > ad.net> -----
> >
> > Date: Wed, 25 Jan 2017 05:27:43 -0000
> > From: Launchpad Buildd System <[hidden email]>
> > To: Bryce Harrington <[hidden email]>
> > Subject: [Build #11913969] amd64 build of inkscape-trunk
> > 1:0.92.0+devel+15444+85~ubuntu16.10.1 in ubuntu yakkety RELEASE
> > [~inkscape.dev/ubuntu/trunk]
> > Reply-To: Launchpad Buildd System <[hidden email]>
> >
> >
> >  * Source Package: inkscape-trunk
> >  * Version: 1:0.92.0+devel+15444+85~ubuntu16.10.1
> >  * Architecture: amd64
> >  * Archive: ~inkscape.dev/ubuntu/trunk
> >  * Component: main
> >  * State: Failed to build
> >  * Duration: 45 minutes
> >  * Build Log: https://launchpad.net/~inkscape.dev/+archive/ubuntu/tru
> > nk/+build/11913969/+files/buildlog_ubuntu-yakkety-amd64.inkscape-
> > trunk_1%3A0.92.0+devel+15444+85~ubuntu16.10.1_BUILDING.txt.gz
> >  * Builder: https://launchpad.net/builders/lgw01-42
> >  * Source: not available
> >
> >
> >
> > If you want further information about this situation, feel free to
> > contact a member of the Launchpad Buildd Administrators team.
> >

------------------------------------------------------------------------------
Check out the vibrant tech community on one of the world's most
engaging tech sites, SlashDot.org! http://sdm.link/slashdot
_______________________________________________
Inkscape-devel mailing list
[hidden email]
https://lists.sourceforge.net/lists/listinfo/inkscape-devel
Loading...